Reaction Details
TargetFarnesyl pyrophosphate synthase
LigandBDBM50135836
Substrate/Competitorn/a
Meas. Tech.ChEMBL_69840 (CHEMBL681891)
Ki 10±n/a nM
Citation Sanders, JMGómez, AOMao, JMeints, GAVan Brussel, EMBurzynska, AKafarski, PGonzález-Pacanowska, DOldfield, E 3-D QSAR investigations of the inhibition of Leishmania major farnesyl pyrophosphate synthase by bisphosphonates. J Med Chem46:5171-83 (2003) 
 
Farnesyl pyrophosphate synthase
Name:Farnesyl pyrophosphate synthase
Type:Enzyme
Mol. Mass.:48272.89
Organism:Homo sapiens (Human)
Description:P14324
Residue:419
BDBM50135836
NameBDBM50135836
Synonyms:1-(2-Hydroxy-2,2-bis-phosphono-ethyl)-3H-imidazol-1-ium ZOLEDRONIC ACID
TypeSmall organic molecule
Emp. Form.C5H11N2O7P2
Mol. Mass.273.097
SMILESOC(C[n+]1cc[nH]c1)(P(O)(O)=O)P(O)(O)=O