Reaction Details
TargetFarnesyl pyrophosphate synthase
LigandBDBM50115110
Substrate/Competitorn/a
Meas. Tech.ChEMBL_69840 (CHEMBL681891)
Ki 33±n/a nM
Citation Sanders, JMGómez, AOMao, JMeints, GAVan Brussel, EMBurzynska, AKafarski, PGonzález-Pacanowska, DOldfield, E 3-D QSAR investigations of the inhibition of Leishmania major farnesyl pyrophosphate synthase by bisphosphonates. J Med Chem46:5171-83 (2003) 
 
Farnesyl pyrophosphate synthase
Name:Farnesyl pyrophosphate synthase
Type:Enzyme
Mol. Mass.:48272.89
Organism:Homo sapiens (Human)
Description:P14324
Residue:419
BDBM50115110
NameBDBM50115110
Synonyms:(Pentylamino-phosphono-methyl)-phosphonic acid CHEMBL56255
TypeSmall organic molecule
Emp. Form.C6H17NO6P2
Mol. Mass.261.1498
SMILESCCCCCN=C(P(O)(O)O)P(O)(O)=O