Reaction Details
TargetFarnesyl pyrophosphate synthase
LigandBDBM12577
Substrate/Competitorn/a
Meas. Tech.ChEMBL_69840 (CHEMBL681891)
Ki 46±n/a nM
Citation Sanders, JMGómez, AOMao, JMeints, GAVan Brussel, EMBurzynska, AKafarski, PGonzález-Pacanowska, DOldfield, E 3-D QSAR investigations of the inhibition of Leishmania major farnesyl pyrophosphate synthase by bisphosphonates. J Med Chem46:5171-83 (2003) 
 
Farnesyl pyrophosphate synthase
Name:Farnesyl pyrophosphate synthase
Type:Enzyme
Mol. Mass.:48272.89
Organism:Homo sapiens (Human)
Description:P14324
Residue:419
BDBM12577
NameBDBM12577
Synonyms:Bisphosphonate 2 JMC515594 Compound 53 | {1-hydroxy-3-[methyl(pentyl)amino]-1-phosphonopropyl}phosphonic acid
TypeSmall organic molecule
Emp. Form.C9H23NO7P2
Mol. Mass.319.2289
SMILESCCCCCN(C)CCC(O)(P(O)(O)=O)P(O)(O)=O