Reaction Details
TargetFarnesyl pyrophosphate synthase
LigandBDBM50117257
Substrate/Competitorn/a
Meas. Tech.ChEMBL_69840 (CHEMBL681891)
Ki 47±n/a nM
Citation Sanders, JMGómez, AOMao, JMeints, GAVan Brussel, EMBurzynska, AKafarski, PGonzález-Pacanowska, DOldfield, E 3-D QSAR investigations of the inhibition of Leishmania major farnesyl pyrophosphate synthase by bisphosphonates. J Med Chem46:5171-83 (2003) 
 
Farnesyl pyrophosphate synthase
Name:Farnesyl pyrophosphate synthase
Type:Enzyme
Mol. Mass.:48272.89
Organism:Homo sapiens (Human)
Description:P14324
Residue:419
BDBM50117257
NameBDBM50117257
Synonyms:1-hydroxy-3-(methyl(3-phenylpropyl)amino)propane-1,1-diyldiphosphonic acid {1-Hydroxy-3-[methyl-(3-phenyl-propyl)-amino]-1-phosphono-propyl}-phosphonic acid
TypeSmall organic molecule
Emp. Form.C13H23NO7P2
Mol. Mass.367.2717
SMILESCN(CCCc1ccccc1)CCC(O)(P(O)(O)=O)P(O)(O)=O