Reaction Details
TargetAldo-keto reductase family 1 member B1
LigandBDBM50135851
Substrate/Competitorn/a
Meas. Tech.ChEMBL_31765 (CHEMBL641359)
IC50 6400±n/a nM
Citation de la Fuente, JAManzanaro, SMartín, MJde Quesada, TGReymundo, ILuengo, SMGago, F Synthesis, activity, and molecular modeling studies of novel human aldose reductase inhibitors based on a marine natural product. J Med Chem46:5208-21 (2003) 
 
Aldo-keto reductase family 1 member B1
Name:Aldo-keto reductase family 1 member B1
Type:Protein
Mol. Mass.:35855.50
Organism:Homo sapiens (Human)
Description:P15121. 4LAU; 2IKI; 4LB4; 2FZD; 2FZ8; 1US0
Residue:316
BDBM50135851
NameBDBM50135851
Synonyms:2,3,4,5-tetrabromo-6-(3,5-dibromo-2-hydroxy-phenoxy)-phenol CHEMBL150098
TypeSmall organic molecule
Emp. Form.C12H4Br6O3
Mol. Mass.675.582
SMILESOc1c(Br)cc(Br)cc1Oc1c(O)c(Br)c(Br)c(Br)c1Br