Reaction Details
TargetCarboxypeptidase B2
LigandBDBM50135935
Substrate/Competitorn/a
Meas. Tech.ChEMBL_45639 (CHEMBL655449)
IC50 21±n/a nM
Citation Barrow, JCNantermet, PGStauffer, SRNgo, PLSteinbeiser, MAMao, SSCarroll, SSBailey, CColussi, DBosserman, MBurlein, CCook, JJSitko, GTiller, PRMiller-Stein, CMRose, MMcMasters, DRVacca, JPSelnick, HG Synthesis and evaluation of imidazole acetic acid inhibitors of activated thrombin-activatable fibrinolysis inhibitor as novel antithrombotics. J Med Chem46:5294-7 (2003) 
 
Carboxypeptidase B2
Name:Carboxypeptidase B2
Type:Enzyme
Mol. Mass.:48432.74
Organism:Homo sapiens (Human)
Description:Q96IY4
Residue:423
BDBM50135935
NameBDBM50135935
Synonyms:3-(6-Amino-pyridin-3-yl)-2-(1-benzyl-1H-imidazol-4-yl)-propionic acid | CHEMBL436425
TypeSmall organic molecule
Emp. Form.C18H18N4O2
Mol. Mass.322.3611
SMILESNc1ccc(CC(C(O)=O)c2cn(Cc3ccccc3)cn2)cn1