Reaction Details
TargetCarboxypeptidase B2
LigandBDBM50135936
Substrate/Competitorn/a
Meas. Tech.ChEMBL_45639 (CHEMBL655449)
IC50 6±n/a nM
Citation Barrow, JCNantermet, PGStauffer, SRNgo, PLSteinbeiser, MAMao, SSCarroll, SSBailey, CColussi, DBosserman, MBurlein, CCook, JJSitko, GTiller, PRMiller-Stein, CMRose, MMcMasters, DRVacca, JPSelnick, HG Synthesis and evaluation of imidazole acetic acid inhibitors of activated thrombin-activatable fibrinolysis inhibitor as novel antithrombotics. J Med Chem46:5294-7 (2003) 
 
Carboxypeptidase B2
Name:Carboxypeptidase B2
Type:Enzyme
Mol. Mass.:48432.74
Organism:Homo sapiens (Human)
Description:Q96IY4
Residue:423
BDBM50135936
NameBDBM50135936
Synonyms:3-(6-Amino-pyridin-3-yl)-2-(1-butyl-1H-imidazol-4-yl)-propionic acid | CHEMBL149680
TypeSmall organic molecule
Emp. Form.C15H20N4O2
Mol. Mass.288.3449
SMILESCCCCn1cnc(c1)C(Cc1ccc(N)nc1)C(O)=O