Reaction Details
TargetCarboxypeptidase M
LigandBDBM50100009
Substrate/Competitorn/a
Meas. Tech.ChEMBL_45790 (CHEMBL660086)
IC50>50000±n/a nM
Citation Barrow, JCNantermet, PGStauffer, SRNgo, PLSteinbeiser, MAMao, SSCarroll, SSBailey, CColussi, DBosserman, MBurlein, CCook, JJSitko, GTiller, PRMiller-Stein, CMRose, MMcMasters, DRVacca, JPSelnick, HG Synthesis and evaluation of imidazole acetic acid inhibitors of activated thrombin-activatable fibrinolysis inhibitor as novel antithrombotics. J Med Chem46:5294-7 (2003) 
 
Carboxypeptidase M
Name:Carboxypeptidase M
Type:PROTEIN
Mol. Mass.:50519.81
Organism:Homo sapiens (Human)
Description:ChEMBL_45790
Residue:443
BDBM50100009
NameBDBM50100009
Synonyms:2-(1H-Imidazol-4-yl)-3-phenyl-propionic acid CHEMBL33352
TypeSmall organic molecule
Emp. Form.C12H12N2O2
Mol. Mass.216.2359
SMILESOC(=O)C(Cc1ccccc1)c1cnc[nH]1