Reaction Details
TargetCarboxypeptidase M
LigandBDBM50135936
Substrate/Competitorn/a
Meas. Tech.ChEMBL_45790 (CHEMBL660086)
IC50>50000±n/a nM
Citation Barrow, JCNantermet, PGStauffer, SRNgo, PLSteinbeiser, MAMao, SSCarroll, SSBailey, CColussi, DBosserman, MBurlein, CCook, JJSitko, GTiller, PRMiller-Stein, CMRose, MMcMasters, DRVacca, JPSelnick, HG Synthesis and evaluation of imidazole acetic acid inhibitors of activated thrombin-activatable fibrinolysis inhibitor as novel antithrombotics. J Med Chem46:5294-7 (2003) 
 
Carboxypeptidase M
Name:Carboxypeptidase M
Type:PROTEIN
Mol. Mass.:50519.81
Organism:Homo sapiens (Human)
Description:ChEMBL_45790
Residue:443
BDBM50135936
NameBDBM50135936
Synonyms:3-(6-Amino-pyridin-3-yl)-2-(1-butyl-1H-imidazol-4-yl)-propionic acid | CHEMBL149680
TypeSmall organic molecule
Emp. Form.C15H20N4O2
Mol. Mass.288.3449
SMILESCCCCn1cnc(c1)C(Cc1ccc(N)nc1)C(O)=O