Reaction Details
TargetCarboxypeptidase A1
LigandBDBM50135938
Substrate/Competitorn/a
Meas. Tech.ChEMBL_45620 (CHEMBL655431)
IC50 6400±n/a nM
Citation Barrow, JCNantermet, PGStauffer, SRNgo, PLSteinbeiser, MAMao, SSCarroll, SSBailey, CColussi, DBosserman, MBurlein, CCook, JJSitko, GTiller, PRMiller-Stein, CMRose, MMcMasters, DRVacca, JPSelnick, HG Synthesis and evaluation of imidazole acetic acid inhibitors of activated thrombin-activatable fibrinolysis inhibitor as novel antithrombotics. J Med Chem46:5294-7 (2003) 
 
Carboxypeptidase A1
Name:Carboxypeptidase A1
Type:PROTEIN
Mol. Mass.:47132.61
Organism:Homo sapiens (Human)
Description:ChEMBL_1496378
Residue:419
BDBM50135938
NameBDBM50135938
Synonyms:3-(6-Amino-pyridin-3-yl)-2-(1-isopropyl-1H-imidazol-4-yl)-propionic acid | CHEMBL356252
TypeSmall organic molecule
Emp. Form.C14H18N4O2
Mol. Mass.274.3183
SMILESCC(C)n1cnc(c1)C(Cc1ccc(N)nc1)C(O)=O