Reaction Details
TargetIntegrin alpha-IIb/beta-3
LigandBDBM50083763
Substrate/Competitorn/a
Meas. Tech.ChEMBL_30119 (CHEMBL640476)
IC50>10000±n/a nM
Citation Feuston, BPCulberson, JCHartman, GD Molecular model of the alpha(IIb)beta(3) integrin. J Med Chem46:5316-25 (2003) 
 
Integrin alpha-IIb/beta-3
Name:Integrin alpha-IIb/beta-3
Synonyms:Glycoprotein IIb/IIIa
Type:n/a
Mol. Mass.:n/a
Description:ASSAY_ID of EBI is 30109
Components:This complex has 2 components.
Component 1
Name:Integrin beta-3
Type:Protein
Mol. Mass.:87038.91
Organism:Homo sapiens (Human)
Description:P05106
Residue:788
Component 2
Name:Integrin alpha-IIb
Synonyms:CD_antigen=CD41 GPIIb Glycoprotein IIb ITGA2B Integrin alpha-IIb heavy chain Integrin alpha-IIb light chain, form 2 Integrin alpha-V/beta-3 and alpha-IIb/beta 3 | Platelet membrane glycoprotein IIb
Type:Protein
Mol. Mass.:113354.85
Organism:Homo sapiens (Human)
Description:P08514
Residue:1039
BDBM50083763
NameBDBM50083763
Synonyms:CHEMBL86992 [8-[2-(6-Methylamino-pyridin-2-yl)-ethoxy]-3-oxo-2-(2,2,2-trifluoro-ethyl)-2,3,4,5-tetrahydro-1H-benzo[c]azepin-4-yl]-acetic acid
TypeSmall organic molecule
Emp. Form.C22H24F3N3O4
Mol. Mass.451.4389
SMILESCNc1cccc(CCOc2ccc3C[C@@H](CC(O)=O)C(=O)N(CC(F)(F)F)Cc3c2)n1