Reaction Details
TargetMitogen-activated protein kinase 8
LigandBDBM50136008
Substrate/Competitorn/a
Meas. Tech.ChEMBL_216826 (CHEMBL816405)
IC50 448.0±n/a nM
Citation Gingrich, DEReddy, DRIqbal, MASingh, JAimone, LDAngeles, TSAlbom, MYang, SAtor, MAMeyer, SLRobinson, CRuggeri, BADionne, CAVaught, JLMallamo, JPHudkins, RL A new class of potent vascular endothelial growth factor receptor tyrosine kinase inhibitors: structure-activity relationships for a series of 9-alkoxymethyl-12-(3-hydroxypropyl)indeno[2,1-a]pyrrolo[3,4-c]carbazole-5-ones and the identification of CEP-5214 and its dimethylglycine ester prodrug clin J Med Chem46:5375-88 (2003) 
 
Mitogen-activated protein kinase 8
Name:Mitogen-activated protein kinase 8
Type:Enzyme
Mol. Mass.:48297.57
Organism:Homo sapiens (Human)
Description:JNK-1 was purchased from Upstate Cell Signaling Solutions (formerly Upstate Biotechnology).
Residue:427
BDBM50136008
NameBDBM50136008
Synonyms:12-(3-hydroxypropyl)-9-isopropoxymethyl-6,7,12,13-tetrahydro-5H-indeno[2,1-a]pyrrolo[4,3-c]carbazol-5-one | CHEMBL150894
TypeSmall organic molecule
Emp. Form.C28H28N2O3
Mol. Mass.440.5335
SMILESCC(C)OCc1ccc2n(CCCO)c3c4Cc5ccccc5-c4c4C(=O)NCc4c3c2c1