Reaction Details
TargetVascular endothelial growth factor receptor 2
LigandBDBM50136030
Substrate/Competitorn/a
Meas. Tech.ChEMBL_214107 (CHEMBL820693)
IC50 48±n/a nM
Citation Gingrich, DEReddy, DRIqbal, MASingh, JAimone, LDAngeles, TSAlbom, MYang, SAtor, MAMeyer, SLRobinson, CRuggeri, BADionne, CAVaught, JLMallamo, JPHudkins, RL A new class of potent vascular endothelial growth factor receptor tyrosine kinase inhibitors: structure-activity relationships for a series of 9-alkoxymethyl-12-(3-hydroxypropyl)indeno[2,1-a]pyrrolo[3,4-c]carbazole-5-ones and the identification of CEP-5214 and its dimethylglycine ester prodrug clin J Med Chem46:5375-88 (2003) 
 
Vascular endothelial growth factor receptor 2
Name:Vascular endothelial growth factor receptor 2
Type:Receptor Tyrosine Kinase
Mol. Mass.:151510.97
Organism:Homo sapiens (Human)
Description:P35968
Residue:1356
BDBM50136030
NameBDBM50136030
Synonyms:12-(3-hydroxypropyl)-6,7,12,13-tetrahydro-5H-indeno[2,1-a]pyrrolo[4,3-c]carbazol-5-one | CHEMBL347999
TypeSmall organic molecule
Emp. Form.C24H20N2O2
Mol. Mass.368.4278
SMILESOCCCn1c2ccccc2c2c3CNC(=O)c3c3-c4ccccc4Cc3c12