Reaction Details
TargetCarbonic anhydrase 2
LigandBDBM33280
Substrate/Competitorn/a
Meas. Tech.ChEMBL_45234 (CHEMBL657192)
Ki 0.7±n/a nM
Citation Winum, JYVullo, DCasini, AMontero, JLScozzafava, ASupuran, CT Carbonic anhydrase inhibitors: inhibition of transmembrane, tumor-associated isozyme IX, and cytosolic isozymes I and II with aliphatic sulfamates. J Med Chem46:5471-7 (2003) 
 
Carbonic anhydrase 2
Name:Carbonic anhydrase 2
Type:Enzyme
Mol. Mass.:29250.71
Organism:Homo sapiens (Human)
Description:P00918
Residue:260
BDBM33280
NameBDBM33280
Synonyms:CHEMBL153094 | aliphatic sulfamate, 2
TypeSmall organic molecule
Emp. Form.C10H23NO3S
Mol. Mass.237.36
SMILESCCCCCCCCCCOS(N)(=O)=O