Reaction Details
TargetProstaglandin G/H synthase 1
LigandBDBM50136106
Substrate/Competitorn/a
Meas. Tech.ChEMBL_158601 (CHEMBL766823)
IC50 25000±n/a nM
Citation Khanapure, SPGarvey, DSYoung, DVEzawa, MEarl, RAGaston, RDFang, XMurty, MMartino, AShumway, MTrocha, MMarek, PTam, SWJanero, DRLetts, LG Synthesis and structure-activity relationship of novel, highly potent metharyl and methcycloalkyl cyclooxygenase-2 (COX-2) selective inhibitors. J Med Chem46:5484-504 (2003) 
 
Prostaglandin G/H synthase 1
Name:Prostaglandin G/H synthase 1
Type:Enzyme
Mol. Mass.:68692.62
Organism:Homo sapiens (Human)
Description:P23219
Residue:599
BDBM50136106
NameBDBM50136106
Synonyms:4-(6-Benzyl-benzo[1,3]dioxol-5-yl)-benzenesulfonamide | CHEMBL151042
TypeSmall organic molecule
Emp. Form.C20H17NO4S
Mol. Mass.367.418
SMILESNS(=O)(=O)c1ccc(cc1)-c1cc2OCOc2cc1Cc1ccccc1