Reaction Details
TargetMelatonin receptor type 1A
LigandBDBM50136405
Substrate/Competitorn/a
Meas. Tech.ChEBML_105102
Ki 0.900000±n/a nM
Citation Sun, LQChen, JMattson, RJEpperson, JRDeskus, JALi, WSTakaki, KHodges, DBIben, LMahle, CDOrtiz, AMolstad, DRyan, EYeleswaram, KXu, CLuo, G Heterocyclic aminopyrrolidine derivatives as melatoninergic agents. Bioorg Med Chem Lett13:4381-4 (2003) Melatonin receptor type 1A
Name:Melatonin receptor type 1A
Type:Enzyme
Mol. Mass.:39392.94
Organism:Homo sapiens (Human)
Description:P48039
Residue:350
BDBM50136405
NameBDBM50136405
Synonyms:1-[(S)-1-(2,3-Dihydro-benzofuran-4-yl)-pyrrolidin-3-yl]-3-methyl-urea | CHEMBL138012
TypeSmall organic molecule
Emp. Form.C14H19N3O2
Mol. Mass.261.3196
SMILESCNC(=O)N[C@H]1CCN(C1)c1cccc2OCCc12