Reaction Details
TargetGlycogen phosphorylase, muscle form
LigandBDBM50136435
Substrate/Competitorn/a
Meas. Tech.ChEBML_70995
IC50 55±n/a nM
Citation Rosauer, KGOgawa, AKWilloughby, CAEllsworth, KPGeissler, WMMyers, RWDeng, QChapman, KTHarris, GMoller, DE Novel 3,4-dihydroquinolin-2(1H)-one inhibitors of human glycogen phosphorylase a. Bioorg Med Chem Lett13:4385-8 (2003) Glycogen phosphorylase, muscle form
Name:Glycogen phosphorylase, muscle form
Type:PROTEIN
Mol. Mass.:97097.45
Organism:Homo sapiens (Human)
Description:ChEMBL_1449751
Residue:842
BDBM50136435
NameBDBM50136435
Synonyms:5-Chloro-1H-indole-2-carboxylic acid (2-oxo-2,3,4,5-tetrahydro-1H-benzo[b]azepin-3-yl)-amide | CHEMBL136327
TypeSmall organic molecule
Emp. Form.C19H16ClN3O2
Mol. Mass.353.802
SMILESClc1ccc2[nH]c(cc2c1)C(=O)NC1CCc2ccccc2NC1=O