Reaction Details
TargetGlycogen phosphorylase, muscle form
LigandBDBM50136443
Substrate/Competitorn/a
Meas. Tech.ChEBML_70995
IC50 98±n/a nM
Citation Rosauer, KGOgawa, AKWilloughby, CAEllsworth, KPGeissler, WMMyers, RWDeng, QChapman, KTHarris, GMoller, DE Novel 3,4-dihydroquinolin-2(1H)-one inhibitors of human glycogen phosphorylase a. Bioorg Med Chem Lett13:4385-8 (2003) Glycogen phosphorylase, muscle form
Name:Glycogen phosphorylase, muscle form
Type:PROTEIN
Mol. Mass.:97097.45
Organism:Homo sapiens (Human)
Description:ChEMBL_1449751
Residue:842
BDBM50136443
NameBDBM50136443
Synonyms:5-Methyl-1H-indole-2-carboxylic acid (1-methyl-2-oxo-1,2,3,4-tetrahydro-quinolin-3-yl)-amide | CHEMBL136572
TypeSmall organic molecule
Emp. Form.C20H19N3O2
Mol. Mass.333.3838
SMILESCN1C(=O)C(Cc2ccccc12)NC(=O)c1cc2cc(C)ccc2[nH]1