Reaction Details
TargetGlycogen phosphorylase, muscle form
LigandBDBM50136451
Substrate/Competitorn/a
Meas. Tech.ChEBML_70995
IC50 32±n/a nM
Citation Rosauer, KGOgawa, AKWilloughby, CAEllsworth, KPGeissler, WMMyers, RWDeng, QChapman, KTHarris, GMoller, DE Novel 3,4-dihydroquinolin-2(1H)-one inhibitors of human glycogen phosphorylase a. Bioorg Med Chem Lett13:4385-8 (2003) Glycogen phosphorylase, muscle form
Name:Glycogen phosphorylase, muscle form
Type:PROTEIN
Mol. Mass.:97097.45
Organism:Homo sapiens (Human)
Description:ChEMBL_1449751
Residue:842
BDBM50136451
NameBDBM50136451
Synonyms:5-Chloro-1H-indole-2-carboxylic acid (1-methyl-2-oxo-1,2,3,4-tetrahydro-quinolin-3-yl)-amide | CHEMBL337332
TypeSmall organic molecule
Emp. Form.C19H16ClN3O2
Mol. Mass.353.802
SMILESCN1C(=O)C(Cc2ccccc12)NC(=O)c1cc2cc(Cl)ccc2[nH]1