Reaction Details
Target5-hydroxytryptamine receptor 1D
LigandBDBM50136469
Substrate/Competitorn/a
Meas. Tech.ChEMBL_1724 (CHEMBL616929)
Ki 2±n/a nM
Citation Isaac, MSlassi, MXin, TArora, JO'Brien, AEdwards, LMacLean, NWilson, JDemschyshyn, LLabrie, PNaismith, AMaddaford, SPapac, DHarrison, SWang, HDraper, STehim, A Design, synthesis and biological activity of novel dimethyl-[2-[6-substituted-indol-1-yl]-ethyl]-amine as potent, selective, and orally-bioavailable 5-HT(1D) agonists. Bioorg Med Chem Lett13:4409-13 (2003) 5-hydroxytryptamine receptor 1D
Name:5-hydroxytryptamine receptor 1D
Type:G Protein-Coupled Receptor (GPCR)
Mol. Mass.:41920.63
Organism:Homo sapiens (Human)
Description:Receptor binding assays were performed using human clone stably expressed in CHO cells.
Residue:377
BDBM50136469
NameBDBM50136469
Synonyms:4-[1-(2-Dimethylamino-ethyl)-1H-indol-6-yl]-tetrahydro-thiopyran-4-ol | CHEMBL138872
TypeSmall organic molecule
Emp. Form.C17H24N2OS
Mol. Mass.304.45
SMILESCN(C)CCn1ccc2ccc(cc12)C1(O)CCSCC1