Reaction Details
Target5-hydroxytryptamine receptor 1D
LigandBDBM50136471
Substrate/Competitorn/a
Meas. Tech.ChEBML_1724
Ki 4.6±n/a nM
Citation Isaac, MSlassi, MXin, TArora, JO'Brien, AEdwards, LMacLean, NWilson, JDemschyshyn, LLabrie, PNaismith, AMaddaford, SPapac, DHarrison, SWang, HDraper, STehim, A Design, synthesis and biological activity of novel dimethyl-[2-[6-substituted-indol-1-yl]-ethyl]-amine as potent, selective, and orally-bioavailable 5-HT(1D) agonists. Bioorg Med Chem Lett13:4409-13 (2003) 5-hydroxytryptamine receptor 1D
Name:5-hydroxytryptamine receptor 1D
Type:G Protein-Coupled Receptor (GPCR)
Mol. Mass.:41920.63
Organism:Homo sapiens (Human)
Description:Receptor binding assays were performed using human clone stably expressed in CHO cells.
Residue:377
BDBM50136471
NameBDBM50136471
Synonyms:(S)-1-{2-[4-(4-Carbamoyl-phenyl)-piperazin-1-yl]-ethyl}-isochroman-6-carboxylic acid methylamide | CHEMBL441095
TypeSmall organic molecule
Emp. Form.C24H30N4O3
Mol. Mass.422.52
SMILESCNC(=O)c1ccc2[C@H](CCN3CCN(CC3)c3ccc(cc3)C(N)=O)OCCc2c1