Reaction Details
TargetNischarin
LigandBDBM50132097
Substrate/Competitorn/a
Meas. Tech.ChEMBL_220588 (CHEMBL841867)
Ki 12±n/a nM
Citation Grella, BTeitler, MSmith, CHerrick-Davis, KGlennon, RA Binding of beta-carbolines at 5-HT(2) serotonin receptors. Bioorg Med Chem Lett13:4421-5 (2003) Nischarin
Name:Nischarin
Type:Enzyme
Mol. Mass.:166571.31
Organism:Homo sapiens (Human)
Description:Q9Y2I1
Residue:1504
BDBM50132097
NameBDBM50132097
Synonyms:7-Methoxy-2,3,4,9-tetrahydro-1H-beta-carboline | CHEMBL6310
TypeSmall organic molecule
Emp. Form.C12H14N2O
Mol. Mass.202.2524
SMILESCOc1ccc2c3CCNCc3[nH]c2c1