Reaction Details
TargetMetabotropic glutamate receptor 1/2/3/4/5/6/7/8
LigandBDBM100152
Substrate/Competitorn/a
Meas. Tech.ChEMBL_105564 (CHEMBL711160)
Ki>10000±n/a nM
Citation Grella, BTeitler, MSmith, CHerrick-Davis, KGlennon, RA Binding of beta-carbolines at 5-HT(2) serotonin receptors. Bioorg Med Chem Lett13:4421-5 (2003) Metabotropic glutamate receptor 1/2/3/4/5/6/7/8
Name:Metabotropic glutamate receptor 1/2/3/4/5/6/7/8
Synonyms:Metabotropic glutamate receptor
Type:n/a
Mol. Mass.:n/a
Description:ASSAY_ID of ChEMBL is 219524
Components:This complex has 8 components.
Component 1
Name:Metabotropic glutamate receptor 2
Type:PROTEIN
Mol. Mass.:95786.41
Organism:Rattus norvegicus
Description:ChEMBL_105034
Residue:872
Component 2
Name:Metabotropic glutamate receptor 6
Synonyms:GRM6_RAT Grm6 Metabotropic glutamate receptor 6 (mGlu6) mGlu6 | metabotropic glutamate 6
Type:Enzyme
Mol. Mass.:95095.82
Organism:Rattus norvegicus (Rat)
Description:P35349
Residue:871
Component 3
Name:Metabotropic glutamate receptor 8
Synonyms:GRM8_RAT Grm8 Metabotropic glutamate receptor 8 (mGlu8) glutamate receptor, metabotropic 8 precursor metabotropic glutamate 8
Type:Enzyme
Mol. Mass.:101886.18
Organism:Rattus norvegicus (Rat)
Description:P70579
Residue:908
Component 4
Name:Metabotropic glutamate receptor 4
Synonyms:GRM4_RAT Grm4 Metabotropic glutamate receptor 4 (mGlu4) mGlu4 metabotropic glutamate 4a
Type:Enzyme
Mol. Mass.:101849.79
Organism:Rattus norvegicus (Rat)
Description:P31423
Residue:912
Component 5
Name:Metabotropic glutamate receptor 3
Synonyms:GRM3_RAT Grm3 glutamate receptor, metabotropic 3 precursor
Type:Protein
Mol. Mass.:98971.84
Organism:Rattus norvegicus (Rat)
Description:P31422
Residue:879
Component 6
Name:Metabotropic glutamate receptor 5
Synonyms:GRM5_RAT Grm5 Mglur5 metabotropic glutamate 5/1-C metabotropic glutamate 5a
Type:Enzyme
Mol. Mass.:131900.14
Organism:Rattus norvegicus (Rat)
Description:P31424
Residue:1203
Component 7
Name:Metabotropic glutamate receptor 1
Synonyms:GRM1_RAT Grm1 Metabotropic glutamate receptor Mglur1 metabotropic glutamate 1/5-D metabotropic glutamate receptor 1 isoform alpha precursor
Type:Enzyme Catalytic Domain
Mol. Mass.:133240.47
Organism:RAT
Description:metabotropic glutamate 1/2 0 RAT::P23385
Residue:1199
Component 8
Name:Metabotropic glutamate receptor 7
Synonyms:GRM7_RAT Grm7 Metabotropic glutamate receptor 7 (mGlu7) mGlu7
Type:Enzyme
Mol. Mass.:102244.48
Organism:Rattus norvegicus (Rat)
Description:P35400
Residue:915
BDBM100152
NameBDBM100152
Synonyms:7-methoxy-1-methyl-9H-beta-carboline;hydrochloride HARMINE MLS002153910 cid_5359389
TypeSmall organic molecule
Emp. Form.C13H12N2O
Mol. Mass.212.2472
SMILESCOc1ccc2c(c1)[nH]c1c(C)nccc21