Reaction Details
Target5-hydroxytryptamine receptor 2C
LigandBDBM50136494
Substrate/Competitorn/a
Meas. Tech.ChEBML_2828
Ki 48±n/a nM
Citation Grella, BTeitler, MSmith, CHerrick-Davis, KGlennon, RA Binding of beta-carbolines at 5-HT(2) serotonin receptors. Bioorg Med Chem Lett13:4421-5 (2003) 5-hydroxytryptamine receptor 2C
Name:5-hydroxytryptamine receptor 2C
Type:Enzyme
Mol. Mass.:51935.10
Organism:Rattus norvegicus (Rat)
Description:P08909
Residue:460
BDBM50136494
NameBDBM50136494
Synonyms:8-Bromo-2,3,4,9-tetrahydro-1H-beta-carboline | CHEMBL6857
TypeSmall organic molecule
Emp. Form.C11H11BrN2
Mol. Mass.251.122
SMILESBrc1cccc2c3CCNCc3[nH]c12