Reaction Details
TargetSodium-dependent noradrenaline transporter
LigandBDBM100152
Substrate/Competitorn/a
Meas. Tech.ChEBML_142610
Ki 3260±n/a nM
Citation Grella, BTeitler, MSmith, CHerrick-Davis, KGlennon, RA Binding of beta-carbolines at 5-HT(2) serotonin receptors. Bioorg Med Chem Lett13:4421-5 (2003) Sodium-dependent noradrenaline transporter
Name:Sodium-dependent noradrenaline transporter
Type:Multi-pass membrane protein
Mol. Mass.:69337.72
Organism:Homo sapiens (Human)
Description:P23975
Residue:617
BDBM100152
NameBDBM100152
Synonyms:7-methoxy-1-methyl-9H-beta-carboline;hydrochloride HARMINE MLS002153910 cid_5359389
TypeSmall organic molecule
Emp. Form.C13H12N2O
Mol. Mass.212.2472
SMILESCOc1ccc2c(c1)[nH]c1c(C)nccc21