Reaction Details
TargetSodium-dependent serotonin transporter
LigandBDBM50136686
Substrate/Competitorn/a
Meas. Tech.ChEBML_201368
Ki 3.5±n/a nM
Citation Bymaster, FPBeedle, EEFindlay, JGallagher, PTKrushinski, JHMitchell, SRobertson, DWThompson, DCWallace, LWong, DT Duloxetine (Cymbalta), a dual inhibitor of serotonin and norepinephrine reuptake. Bioorg Med Chem Lett13:4477-80 (2003) Sodium-dependent serotonin transporter
Name:Sodium-dependent serotonin transporter
Type:Multi-pass membrane protein
Mol. Mass.:70322.51
Organism:Homo sapiens (Human)
Description:P31645
Residue:630
BDBM50136686
NameBDBM50136686
Synonyms:CHEMBL415244 | [3-(4-Methoxy-phenyl)-3-(naphthalen-1-yloxy)-propyl]-methyl-amine
TypeSmall organic molecule
Emp. Form.C21H23NO2
Mol. Mass.321.4128
SMILESCNCCC(Oc1cccc2ccccc12)c1ccc(OC)cc1