Reaction Details
TargetOrexin receptor type 2
LigandBDBM50136705
Substrate/Competitorn/a
Meas. Tech.ChEBML_147798
IC50 900±n/a nM
Citation Hirose, MEgashira, SGoto, YHashihayata, TOhtake, NIwaasa, HHata, MFukami, TKanatani, AYamada, K N-acyl 6,7-dimethoxy-1,2,3,4-tetrahydroisoquinoline: the first orexin-2 receptor selective non-peptidic antagonist. Bioorg Med Chem Lett13:4497-9 (2003) Orexin receptor type 2
Name:Orexin receptor type 2
Type:Protein
Mol. Mass.:50710.53
Organism:Homo sapiens (Human)
Description:O43614
Residue:444
BDBM50136705
NameBDBM50136705
Synonyms:(+/-)-N-(1-(6,7-dimethoxy-3,4-dihydroisoquinolin-2(1H)-yl)-1-oxo-3-phenylpropan-2-yl)benzamide N-[1-Benzyl-2-(6,7-dimethoxy-3,4-dihydro-1H-isoquinolin-2-yl)-2-oxo-ethyl]-benzamide
TypeSmall organic molecule
Emp. Form.C27H28N2O4
Mol. Mass.444.5222
SMILESCOc1cc2CCN(Cc2cc1OC)C(=O)C(Cc1ccccc1)NC(=O)c1ccccc1