Reaction Details
TargetOrexin/Hypocretin receptor type 1
LigandBDBM50136718
Substrate/Competitorn/a
Meas. Tech.ChEBML_147674
IC50 3670±n/a nM
Citation Hirose, MEgashira, SGoto, YHashihayata, TOhtake, NIwaasa, HHata, MFukami, TKanatani, AYamada, K N-acyl 6,7-dimethoxy-1,2,3,4-tetrahydroisoquinoline: the first orexin-2 receptor selective non-peptidic antagonist. Bioorg Med Chem Lett13:4497-9 (2003) Orexin/Hypocretin receptor type 1
Name:Orexin/Hypocretin receptor type 1
Type:Protein
Mol. Mass.:47554.50
Organism:Homo sapiens (Human)
Description:O43613
Residue:425
BDBM50136718
NameBDBM50136718
Synonyms:(S)-1-(6,7-Dimethoxy-3,4-dihydro-1H-isoquinolin-2-yl)-3,3-dimethyl-2-[(thiophen-3-ylmethyl)-amino]-butan-1-one CHEMBL343786
TypeSmall organic molecule
Emp. Form.C22H30N2O3S
Mol. Mass.402.55
SMILESCOc1cc2CCN(Cc2cc1OC)C(=O)[C@@H](NCc1ccsc1)C(C)(C)C