Reaction Details
TargetCytosolic phospholipase A2
LigandBDBM50136727
Substrate/Competitorn/a
Meas. Tech.ChEMBL_52522 (CHEMBL665295)
IC50 400±n/a nM
Citation McKew, JCLovering, FClark, JDBemis, JXiang, YShen, MZhang, WAlvarez, JCJoseph-McCarthy, D Structure-activity relationships of indole cytosolic phospholipase A(2)alpha inhibitors: substrate mimetics. Bioorg Med Chem Lett13:4501-4 (2003) Cytosolic phospholipase A2
Name:Cytosolic phospholipase A2
Type:Protein
Mol. Mass.:85219.30
Organism:Homo sapiens (Human)
Description:P47712
Residue:749
BDBM50136727
NameBDBM50136727
Synonyms:4-(1-Benzhydryl-5-nitro-1H-indol-3-ylmethyl)-3-methoxy-benzoic acid | CHEMBL344176
TypeSmall organic molecule
Emp. Form.C30H24N2O5
Mol. Mass.492.522
SMILESCOc1cc(ccc1Cc1cn(C(c2ccccc2)c2ccccc2)c2ccc(cc12)[N+]([O-])=O)C(O)=O