Reaction Details
TargetCytosolic phospholipase A2
LigandBDBM50136739
Substrate/Competitorn/a
Meas. Tech.ChEMBL_52521 (CHEMBL665294)
IC50 1900±n/a nM
Citation McKew, JCLovering, FClark, JDBemis, JXiang, YShen, MZhang, WAlvarez, JCJoseph-McCarthy, D Structure-activity relationships of indole cytosolic phospholipase A(2)alpha inhibitors: substrate mimetics. Bioorg Med Chem Lett13:4501-4 (2003) Cytosolic phospholipase A2
Name:Cytosolic phospholipase A2
Type:Protein
Mol. Mass.:85219.30
Organism:Homo sapiens (Human)
Description:P47712
Residue:749
BDBM50136739
NameBDBM50136739
Synonyms:4-(1-Benzhydryl-5-methoxy-1H-indol-3-ylmethyl)-3-methoxy-benzoic acid | CHEMBL344686
TypeSmall organic molecule
Emp. Form.C31H27NO4
Mol. Mass.477.5504
SMILESCOc1ccc2n(cc(Cc3ccc(cc3OC)C(O)=O)c2c1)C(c1ccccc1)c1ccccc1