Reaction Details
TargetLeukotriene B4 receptor 1
LigandBDBM50136723
Substrate/Competitorn/a
Meas. Tech.ChEBML_99664
IC50 800±n/a nM
Citation McKew, JCLovering, FClark, JDBemis, JXiang, YShen, MZhang, WAlvarez, JCJoseph-McCarthy, D Structure-activity relationships of indole cytosolic phospholipase A(2)alpha inhibitors: substrate mimetics. Bioorg Med Chem Lett13:4501-4 (2003) Leukotriene B4 receptor 1
Name:Leukotriene B4 receptor 1
Type:Enzyme Catalytic Domain
Mol. Mass.:37582.68
Organism:Homo sapiens (Human)
Description:Q15722
Residue:352
BDBM50136723
NameBDBM50136723
Synonyms:4-(1-Benzhydryl-5-cyano-1H-indol-3-ylmethyl)-3-methoxy-benzoic acid | CHEMBL424290
TypeSmall organic molecule
Emp. Form.C31H24N2O3
Mol. Mass.472.5339
SMILESCOc1cc(ccc1Cc1cn(C(c2ccccc2)c2ccccc2)c2ccc(cc12)C#N)C(O)=O