Reaction Details
TargetLeukotriene B4 receptor 1
LigandBDBM50136722
Substrate/Competitorn/a
Meas. Tech.ChEMBL_99665 (CHEMBL705073)
IC50 1100±n/a nM
Citation McKew, JCLovering, FClark, JDBemis, JXiang, YShen, MZhang, WAlvarez, JCJoseph-McCarthy, D Structure-activity relationships of indole cytosolic phospholipase A(2)alpha inhibitors: substrate mimetics. Bioorg Med Chem Lett13:4501-4 (2003) Leukotriene B4 receptor 1
Name:Leukotriene B4 receptor 1
Type:Enzyme Catalytic Domain
Mol. Mass.:37582.68
Organism:Homo sapiens (Human)
Description:Q15722
Residue:352
BDBM50136722
NameBDBM50136722
Synonyms:4-(1-Benzhydryl-5-bromo-1H-indol-3-ylmethyl)-3-methoxy-benzoic acid | CHEMBL140539
TypeSmall organic molecule
Emp. Form.C30H24BrNO3
Mol. Mass.526.42
SMILESCOc1cc(ccc1Cc1cn(C(c2ccccc2)c2ccccc2)c2ccc(Br)cc12)C(O)=O