Reaction Details
TargetGamma-aminobutyric acid receptor subunit alpha-6/beta-3/gamma-2
LigandBDBM25877
Substrate/Competitorn/a
Meas. Tech.ChEMBL_69811 (CHEMBL677846)
Ki 28.8±n/a nM
Citation Li, XCao, HZhang, CFurtmueller, RFuchs, KHuck, SSieghart, WDeschamps, JCook, JM Synthesis, in vitro affinity, and efficacy of a bis 8-ethynyl-4H-imidazo[1,5a]- [1,4]benzodiazepine analogue, the first bivalent alpha5 subtype selective BzR/GABA(A) antagonist. J Med Chem46:5567-70 (2003) 
 
Gamma-aminobutyric acid receptor subunit alpha-6/beta-3/gamma-2
Name:Gamma-aminobutyric acid receptor subunit alpha-6/beta-3/gamma-2
Type:n/a
Mol. Mass.:n/a
Description:ASSAY_ID of EBI is 68432
Components:This complex has 3 components.
Component 1
Name:Gamma-aminobutyric acid receptor subunit gamma-2
Synonyms:GABA(A) receptor subunit gamma-2 GBRG2_HUMAN
Type:PROTEIN
Mol. Mass.:54172.74
Organism:Homo sapiens (Human)
Description:EBI_217
Residue:467
Component 2
Name:Gamma-aminobutyric acid receptor subunit alpha-6
Synonyms:GABA A alpha6 GABRA6 | GBRA6_HUMAN
Type:Enzyme Catalytic Domain
Mol. Mass.:51029.60
Organism:Homo sapiens (Human)
Description:GABA A alpha6 0 HUMAN::Q16445
Residue:453
Component 3
Name:Gamma-aminobutyric acid receptor subunit beta-3
Synonyms:GABA A receptor alpha-4/beta-3/gamma-2 GABA-A receptor GBRB3_HUMAN | agonist GABA site
Type:PROTEIN
Mol. Mass.:54130.51
Organism:Homo sapiens (Human)
Description:ChEMBL_448071
Residue:473
BDBM25877
NameBDBM25877
Synonyms:CHEMBL286594 ethyl 12-ethynyl-8-methyl-9-oxo-2,4,8-triazatricyclo[8.4.0.0^{2,6}]tetradeca-1(14),3,5,10,12-pentaene-5-carboxylate
TypeSmall organic molecule
Emp. Form.C17H15N3O3
Mol. Mass.309.3193
SMILESCCOC(=O)c1ncn-2c1CN(C)C(=O)c1cc(ccc-21)C#C