Reaction Details
TargetGABA A receptor alpha-4/beta-3/gamma-2
LigandBDBM25879
Substrate/Competitorn/a
Meas. Tech.ChEMBL_69794 (CHEMBL678742)
Ki 1550±n/a nM
Citation Li, XCao, HZhang, CFurtmueller, RFuchs, KHuck, SSieghart, WDeschamps, JCook, JM Synthesis, in vitro affinity, and efficacy of a bis 8-ethynyl-4H-imidazo[1,5a]- [1,4]benzodiazepine analogue, the first bivalent alpha5 subtype selective BzR/GABA(A) antagonist. J Med Chem46:5567-70 (2003) 
 
GABA A receptor alpha-4/beta-3/gamma-2
Name:GABA A receptor alpha-4/beta-3/gamma-2
Type:n/a
Mol. Mass.:n/a
Description:ASSAY_ID of ChEMBL is 2148176
Components:This complex has 3 components.
Component 1
Name:Gamma-aminobutyric acid receptor subunit gamma-2
Synonyms:GABA(A) receptor subunit gamma-2 GBRG2_HUMAN
Type:PROTEIN
Mol. Mass.:54172.74
Organism:Homo sapiens (Human)
Description:EBI_217
Residue:467
Component 2
Name:Gamma-aminobutyric acid receptor subunit beta-3
Synonyms:GABA A receptor alpha-4/beta-3/gamma-2 GABA-A receptor GBRB3_HUMAN | agonist GABA site
Type:PROTEIN
Mol. Mass.:54130.51
Organism:Homo sapiens (Human)
Description:ChEMBL_448071
Residue:473
Component 3
Name:Gamma-aminobutyric acid receptor subunit alpha-4
Synonyms:GABA A Alpha4Beta2Gamma2 GABA A Alpha4Gamma2 GABA receptor alpha-4 subunit GABRA4 Gamma-aminobutyric acid receptor subunit alpha-4
Type:Enzyme Catalytic Domain
Mol. Mass.:61648.70
Organism:Homo sapiens (Human)
Description:GABA A Alpha4Beta2Gamma2 0 HUMAN::P48169
Residue:554
BDBM25879
NameBDBM25879
Synonyms:3-({12-ethynyl-8-methyl-9-oxo-2,4,8-triazatricyclo[8.4.0.0^{2,6}]tetradeca-1(14),3,5,10,12-pentaen-5-yl}carbonyloxy)propyl 12-ethynyl-8-methyl-9-oxo-2,4,8-triazatricyclo[8.4.0.0^{2,6}]tetradeca-1(10),3,5,11,13-pentaene-5-carboxylate XLi093, 2
TypeSmall organic molecule
Emp. Form.C33H26N6O6
Mol. Mass.602.5961
SMILESCN1Cc2c(ncn2-c2ccc(cc2C1=O)C#C)C(=O)OCCCOC(=O)c1ncn-2c1CN(C)C(=O)c1cc(ccc-21)C#C