Reaction Details
TargetSomatostatin receptor type 4
LigandBDBM50136812
Substrate/Competitorn/a
Meas. Tech.ChEMBL_200836 (CHEMBL807046)
IC50 0.7±n/a nM
Citation Erchegyi, JWaser, BSchaer, JCCescato, RBrazeau, JFRivier, JReubi, JC Novel sst(4)-selective somatostatin (SRIF) agonists. 3. Analogues amenable to radiolabeling. J Med Chem46:5597-605 (2003) 
 
Somatostatin receptor type 4
Name:Somatostatin receptor type 4
Type:Enzyme
Mol. Mass.:42015.38
Organism:Homo sapiens (Human)
Description:P31391
Residue:388
BDBM50136812
NameBDBM50136812
Synonyms:(S)-25-Amino-13-(4-amino-butyl)-7,19,22-tribenzyl-10-((R)-1-hydroxy-ethyl)-16-(1H-indol-3-ylmethyl)-6,12,18-tri(S)-oxo-9,15,21-tri(R)-oxo-24-oxo-1,2-dithia-5,8,11,14,17,20,23-heptaaza-cyclohexacosane-4-carboxylic acid | CHEMBL406829
TypeSmall organic molecule
Emp. Form.C54H66N10O10S2
Mol. Mass.1079.293
SMILESC[C@@H](O)[C@H]1NC(=O)[C@H](CCCCN)NC(=O)[C@@H](Cc2c[nH]c3ccccc23)NC(=O)[C@H](Cc2ccccc2)NC(=O)[C@@H](Cc2ccccc2)NC(=O)[C@H](N)CSSC[C@H](NC(=O)[C@H](Cc2ccccc2)NC1=O)C(O)=O