Reaction Details
TargetSomatostatin receptor type 4
LigandBDBM50136798
Substrate/Competitorn/a
Meas. Tech.ChEMBL_200836 (CHEMBL807046)
IC50 1.6±n/a nM
Citation Erchegyi, JWaser, BSchaer, JCCescato, RBrazeau, JFRivier, JReubi, JC Novel sst(4)-selective somatostatin (SRIF) agonists. 3. Analogues amenable to radiolabeling. J Med Chem46:5597-605 (2003) 
 
Somatostatin receptor type 4
Name:Somatostatin receptor type 4
Type:Enzyme
Mol. Mass.:42015.38
Organism:Homo sapiens (Human)
Description:P31391
Residue:388
BDBM50136798
NameBDBM50136798
Synonyms:CHEMBL410372 | Somatostatin analogue
TypeSmall organic molecule
Emp. Form.C63H75N11O12S2
Mol. Mass.1242.466
SMILESC[C@H](O)[C@@H]1NC(=O)[C@H](CCCCN)NC(=O)[C@@H](Cc2c[nH]c3ccccc23)NC(=O)[C@H](Cc2ccccc2)NC(=O)[C@@H](Cc2ccccc2)NC(=O)[C@@H](CSSC[C@H](NC(=O)[C@H](Cc2ccccc2)NC1=O)C(O)=O)NC(=O)[C@H](N)Cc1ccc(O)cc1