Reaction Details
Target5'-methylthioadenosine/S-adenosylhomocysteine nucleosidase
LigandBDBM50136905
Substrate/Competitorn/a
Meas. Tech.ChEMBL_103130 (CHEMBL712301)
Ki 240±n/a nM
Citation Li, XChu, SFeher, VAKhalili, MNie, ZMargosiak, SNikulin, VLevin, JSprankle, KGTedder, MEAlmassy, RAppelt, KYager, KM Structure-based design, synthesis, and antimicrobial activity of indazole-derived SAH/MTA nucleosidase inhibitors. J Med Chem46:5663-73 (2003) 
 
5'-methylthioadenosine/S-adenosylhomocysteine nucleosidase
Name:5'-methylthioadenosine/S-adenosylhomocysteine nucleosidase
Type:Enzyme
Mol. Mass.:24347.14
Organism:Escherichia coli (strain K12)
Description:P0AF12
Residue:232
BDBM50136905
NameBDBM50136905
Synonyms:CHEMBL157223 | N-(7-Isobutylamino-3-methyl-1H-indazol-5-yl)-3-pyridin-4-yl-benzenesulfonamide
TypeSmall organic molecule
Emp. Form.C23H25N5O2S
Mol. Mass.435.542
SMILESCC(C)CNc1cc(NS(=O)(=O)c2cccc(c2)-c2ccncc2)cc2c(C)n[nH]c12