Reaction Details
Target5'-methylthioadenosine/S-adenosylhomocysteine nucleosidase
LigandBDBM50136924
Substrate/Competitorn/a
Meas. Tech.ChEMBL_103130 (CHEMBL712301)
Ki 64000±n/a nM
Citation Li, XChu, SFeher, VAKhalili, MNie, ZMargosiak, SNikulin, VLevin, JSprankle, KGTedder, MEAlmassy, RAppelt, KYager, KM Structure-based design, synthesis, and antimicrobial activity of indazole-derived SAH/MTA nucleosidase inhibitors. J Med Chem46:5663-73 (2003) 
 
5'-methylthioadenosine/S-adenosylhomocysteine nucleosidase
Name:5'-methylthioadenosine/S-adenosylhomocysteine nucleosidase
Type:Enzyme
Mol. Mass.:24347.14
Organism:Escherichia coli (strain K12)
Description:P0AF12
Residue:232
BDBM50136924
NameBDBM50136924
Synonyms:5-Dimethylamino-naphthalene-1-sulfonic acid (3-methyl-1H-indazol-5-yl)-amide | CHEMBL347925
TypeSmall organic molecule
Emp. Form.C20H20N4O2S
Mol. Mass.380.463
SMILESCN(C)c1cccc2c(cccc12)S(=O)(=O)Nc1ccc2[nH]nc(C)c2c1