Reaction Details
TargetCoagulation factor X
LigandBDBM50113913
Substrate/Competitorn/a
Meas. Tech.ChEMBL_49306 (CHEMBL663405)
Ki 3±n/a nM
Citation Ostrovsky, DUdier-Blagovic, MJorgensen, WL Analyses of activity for factor Xa inhibitors based on Monte Carlo simulations. J Med Chem46:5691-9 (2003) 
 
Coagulation factor X
Name:Coagulation factor X
Type:Enzyme
Mol. Mass.:54726.60
Organism:Homo sapiens (Human)
Description:n/a
Residue:488
BDBM50113913
NameBDBM50113913
Synonyms:3-[6-(3-Dimethylamino-phenoxy)-3,5-difluoro-4-methyl-pyridin-2-yloxy]-4-hydroxy-benzamidine | CHEMBL82925
TypeSmall organic molecule
Emp. Form.C21H20F2N4O3
Mol. Mass.414.4053
SMILESCN(C)c1cccc(Oc2nc(Oc3cc(ccc3O)C(N)=N)c(F)c(C)c2F)c1