Reaction Details
TargetCoagulation factor X
LigandBDBM50066637
Substrate/Competitorn/a
Meas. Tech.ChEMBL_49306 (CHEMBL663405)
Ki 2.4±n/a nM
Citation Ostrovsky, DUdier-Blagovic, MJorgensen, WL Analyses of activity for factor Xa inhibitors based on Monte Carlo simulations. J Med Chem46:5691-9 (2003) 
 
Coagulation factor X
Name:Coagulation factor X
Type:Enzyme
Mol. Mass.:54726.60
Organism:Homo sapiens (Human)
Description:n/a
Residue:488
BDBM50066637
NameBDBM50066637
Synonyms:2-(5-Carbamimidoyl-2-hydroxy-phenoxy)-6-[3-(1-methyl-4,5-dihydro-1H-imidazol-2-yl)-phenoxy]-isonicotinic acid | CHEMBL84065
TypeSmall organic molecule
Emp. Form.C23H21N5O5
Mol. Mass.447.4433
SMILESCN1CCN=C1c1cccc(Oc2cc(cc(Oc3cc(ccc3O)C(N)=N)n2)C(O)=O)c1