Reaction Details
TargetReverse transcriptase/RNaseH
LigandBDBM50137098
Substrate/Competitorn/a
Meas. Tech.ChEMBL_196363 (CHEMBL805996)
IC50 15100±n/a nM
Citation Behforouz, MCai, WStocksdale, MGLucas, JSJung, JYBriere, DWang, AKaten, KSBehforouz, NC Novel lavendamycin analogues as potent HIV-reverse transcriptase inhibitors: synthesis and evaluation of anti-reverse transcriptase activity of amide and ester analogues of lavendamycin. J Med Chem46:5773-80 (2003) 
 
Reverse transcriptase/RNaseH
Name:Reverse transcriptase/RNaseH
Type:PROTEIN
Mol. Mass.:65229.15
Organism:Human immunodeficiency virus 1
Description:ChEMBL_1473730
Residue:566
BDBM50137098
NameBDBM50137098
Synonyms:1-(7-Acetylamino-5,8-dioxo-5,8-dihydro-quinolin-2-yl)-4-methyl-9H-beta-carboline-3-carboxylic acid methyl ester methyl 1-(7-acetamido-5,8-dioxo-5,8-dihydroquinolin-2-yl)-4-methyl-9H-pyrido[3,4-b]indole-3-carboxylate
TypeSmall organic molecule
Emp. Form.C25H18N4O5
Mol. Mass.454.4342
SMILESCOC(=O)c1[nH]c(-c2ccc3C(=O)C=C(NC(C)=O)C(=O)c3n2)c2nc3ccccc3c2c1C