Reaction Details
TargetEpidermal growth factor receptor
LigandBDBM50137177
Substrate/Competitorn/a
Meas. Tech.ChEBML_67058
IC50 2±n/a nM
Citation Munchhof, MJBeebe, JSCasavant, JMCooper, BADoty, JLHigdon, RCHillerman, SMSoderstrom, CIKnauth, EAMarx, MARossi, AMSobolov, SBSun, J Design and SAR of thienopyrimidine and thienopyridine inhibitors of VEGFR-2 kinase activity. Bioorg Med Chem Lett14:21-4 (2003) Epidermal growth factor receptor
Name:Epidermal growth factor receptor
Type:Receptor Kinase Domain
Mol. Mass.:134279.59
Organism:Homo sapiens (Human)
Description:P00533
Residue:1210
BDBM50137177
NameBDBM50137177
Synonyms:CHEMBL418909 | N-(2-{4-[7-(1H-Indol-5-ylamino)-thieno[3,2-b]pyridin-2-yl]-benzylamino}-ethyl)-acetamide
TypeSmall organic molecule
Emp. Form.C26H25N5OS
Mol. Mass.455.575
SMILESCC(=O)NCCNCc1ccc(cc1)-c1cc2nccc(Nc3ccc4[nH]ccc4c3)c2s1