Reaction Details
TargetEpidermal growth factor receptor
LigandBDBM50137200
Substrate/Competitorn/a
Meas. Tech.ChEBML_67058
IC50 4±n/a nM
Citation Munchhof, MJBeebe, JSCasavant, JMCooper, BADoty, JLHigdon, RCHillerman, SMSoderstrom, CIKnauth, EAMarx, MARossi, AMSobolov, SBSun, J Design and SAR of thienopyrimidine and thienopyridine inhibitors of VEGFR-2 kinase activity. Bioorg Med Chem Lett14:21-4 (2003) Epidermal growth factor receptor
Name:Epidermal growth factor receptor
Type:Receptor Kinase Domain
Mol. Mass.:134279.59
Organism:Homo sapiens (Human)
Description:P00533
Residue:1210
BDBM50137200
NameBDBM50137200
Synonyms:CHEMBL78018 | [6-(4-Aminomethyl-phenyl)-thieno[3,2-d]pyrimidin-4-yl]-(1H-indol-5-yl)-amine
TypeSmall organic molecule
Emp. Form.C21H17N5S
Mol. Mass.371.458
SMILESNCc1ccc(cc1)-c1cc2ncnc(Nc3ccc4[nH]ccc4c3)c2s1