Reaction Details
TargetEpidermal growth factor receptor
LigandBDBM50137175
Substrate/Competitorn/a
Meas. Tech.ChEMBL_67058 (CHEMBL674107)
IC50 1.000±n/a nM
Citation Munchhof, MJBeebe, JSCasavant, JMCooper, BADoty, JLHigdon, RCHillerman, SMSoderstrom, CIKnauth, EAMarx, MARossi, AMSobolov, SBSun, J Design and SAR of thienopyrimidine and thienopyridine inhibitors of VEGFR-2 kinase activity. Bioorg Med Chem Lett14:21-4 (2003) Epidermal growth factor receptor
Name:Epidermal growth factor receptor
Type:Receptor Kinase Domain
Mol. Mass.:134279.59
Organism:Homo sapiens (Human)
Description:P00533
Residue:1210
BDBM50137175
NameBDBM50137175
Synonyms:2-{4-[4-(1H-Indol-5-ylamino)-thieno[3,2-d]pyrimidin-6-yl]-benzylamino}-2-methyl-propan-1-ol | CHEMBL308498
TypeSmall organic molecule
Emp. Form.C25H25N5OS
Mol. Mass.443.564
SMILESCC(C)(CO)NCc1ccc(cc1)-c1cc2ncnc(Nc3ccc4[nH]ccc4c3)c2s1