Reaction Details
TargetVascular endothelial growth factor receptor 1
LigandBDBM50137206
Substrate/Competitorn/a
Meas. Tech.ChEBML_213951
IC50 3±n/a nM
Citation Munchhof, MJBeebe, JSCasavant, JMCooper, BADoty, JLHigdon, RCHillerman, SMSoderstrom, CIKnauth, EAMarx, MARossi, AMSobolov, SBSun, J Design and SAR of thienopyrimidine and thienopyridine inhibitors of VEGFR-2 kinase activity. Bioorg Med Chem Lett14:21-4 (2003) Vascular endothelial growth factor receptor 1
Name:Vascular endothelial growth factor receptor 1
Type:Receptor Tyrosine Kinase
Mol. Mass.:150800.23
Organism:Homo sapiens (Human)
Description:P17948
Residue:1338
BDBM50137206
NameBDBM50137206
Synonyms:(2-Methyl-1H-indol-5-yl)-(2-{4-[(2-pyridin-1-yl-ethylamino)-methyl]-phenyl}-thieno[3,2-b]pyridin-7-yl)-amine | CHEMBL79060
TypeSmall organic molecule
Emp. Form.C29H32N6S
Mol. Mass.496.67
SMILESCc1cc2cc(Nc3ccnc4cc(sc34)-c3ccc(CNCCN4CCNCC4)cc3)ccc2[nH]1