Reaction Details
TargetVascular endothelial growth factor receptor 1
LigandBDBM50137205
Substrate/Competitorn/a
Meas. Tech.ChEBML_213951
IC50 4±n/a nM
Citation Munchhof, MJBeebe, JSCasavant, JMCooper, BADoty, JLHigdon, RCHillerman, SMSoderstrom, CIKnauth, EAMarx, MARossi, AMSobolov, SBSun, J Design and SAR of thienopyrimidine and thienopyridine inhibitors of VEGFR-2 kinase activity. Bioorg Med Chem Lett14:21-4 (2003) Vascular endothelial growth factor receptor 1
Name:Vascular endothelial growth factor receptor 1
Type:Receptor Tyrosine Kinase
Mol. Mass.:150800.23
Organism:Homo sapiens (Human)
Description:P17948
Residue:1338
BDBM50137205
NameBDBM50137205
Synonyms:CHEMBL80809 | N-(2-{4-[4-(1H-Indol-5-ylamino)-thieno[3,2-d]pyrimidin-6-yl]-benzylamino}-ethyl)-acetamide
TypeSmall organic molecule
Emp. Form.C25H24N6OS
Mol. Mass.456.563
SMILESCC(=O)NCCNCc1ccc(cc1)-c1cc2ncnc(Nc3ccc4[nH]ccc4c3)c2s1