Reaction Details
TargetDipeptidyl peptidase 4
LigandBDBM50265158
Substrate/Competitorn/a
Meas. Tech.ChEBML_53362
IC50 2.6±n/a nM
Citation Parmee, ERHe, JMastracchio, AEdmondson, SDColwell, LEiermann, GFeeney, WPHabulihaz, BHe, HKilburn, RLeiting, BLyons, KMarsilio, FPatel, RAPetrov, ADi Salvo, JWu, JKThornberry, NAWeber, AE 4-Amino cyclohexylglycine analogues as potent dipeptidyl peptidase IV inhibitors. Bioorg Med Chem Lett14:43-6 (2003) Dipeptidyl peptidase 4
Name:Dipeptidyl peptidase 4
Type:Enzyme
Mol. Mass.:88271.01
Organism:Homo sapiens (Human)
Description:P27487
Residue:766
BDBM50265158
NameBDBM50265158
Synonyms:CHEMBL497992 | N-((trans)-4-((S)-1-amino-2-oxo-2-(pyrrolidin-1-yl)ethyl)cyclohexyl)-4-(2,2,2-trifluoroethylsulfonamido)benzenesulfonamide
TypeSmall organic molecule
Emp. Form.C20H29F3N4O5S2
Mol. Mass.526.593
SMILESN[C@@H]([C@H]1CC[C@@H](CC1)NS(=O)(=O)c1ccc(NS(=O)(=O)CC(F)(F)F)cc1)C(=O)N1CCCC1