Reaction Details
TargetPotassium voltage-gated channel subfamily H member 2
LigandBDBM50137253
Substrate/Competitorn/a
Meas. Tech.ChEBML_158546
Ki 5900±n/a nM
Citation Parmee, ERHe, JMastracchio, AEdmondson, SDColwell, LEiermann, GFeeney, WPHabulihaz, BHe, HKilburn, RLeiting, BLyons, KMarsilio, FPatel, RAPetrov, ADi Salvo, JWu, JKThornberry, NAWeber, AE 4-Amino cyclohexylglycine analogues as potent dipeptidyl peptidase IV inhibitors. Bioorg Med Chem Lett14:43-6 (2003) Potassium voltage-gated channel subfamily H member 2
Name:Potassium voltage-gated channel subfamily H member 2
Type:Multi-pass membrane protein
Mol. Mass.:126672.65
Organism:Homo sapiens (Human)
Description:Q12809
Residue:1159
BDBM50137253
NameBDBM50137253
Synonyms:CHEMBL22359 | N-[4-((S)-1-Amino-2-oxo-2-thiazolidin-3-yl-ethyl)-cyclohexyl]-3,4-difluoro-benzamide
TypeSmall organic molecule
Emp. Form.C18H23F2N3O2S
Mol. Mass.383.456
SMILES[H][C@@]1(CC[C@@H](CC1)NC(=O)c1ccc(F)c(F)c1)[C@H](N)C(=O)N1CCSC1