Reaction Details
TargetDipeptidyl peptidase 4
LigandBDBM50137254
Substrate/Competitorn/a
Meas. Tech.ChEBML_53362
IC50 900±n/a nM
Citation Parmee, ERHe, JMastracchio, AEdmondson, SDColwell, LEiermann, GFeeney, WPHabulihaz, BHe, HKilburn, RLeiting, BLyons, KMarsilio, FPatel, RAPetrov, ADi Salvo, JWu, JKThornberry, NAWeber, AE 4-Amino cyclohexylglycine analogues as potent dipeptidyl peptidase IV inhibitors. Bioorg Med Chem Lett14:43-6 (2003) Dipeptidyl peptidase 4
Name:Dipeptidyl peptidase 4
Type:Enzyme
Mol. Mass.:88271.01
Organism:Homo sapiens (Human)
Description:P27487
Residue:766
BDBM50137254
NameBDBM50137254
Synonyms:CHEMBL23176 | [4-((S)-1-Amino-2-oxo-2-thiazolidin-3-yl-ethyl)-cyclohexyl]-carbamic acid benzyl ester
TypeSmall organic molecule
Emp. Form.C19H27N3O3S
Mol. Mass.377.501
SMILES[H][C@@]1(CC[C@@H](CC1)NC(=O)OCc1ccccc1)[C@H](N)C(=O)N1CCSC1