Reaction Details
TargetDipeptidyl peptidase 4
LigandBDBM50137260
Substrate/Competitorn/a
Meas. Tech.ChEBML_53362
IC50 4100±n/a nM
Citation Parmee, ERHe, JMastracchio, AEdmondson, SDColwell, LEiermann, GFeeney, WPHabulihaz, BHe, HKilburn, RLeiting, BLyons, KMarsilio, FPatel, RAPetrov, ADi Salvo, JWu, JKThornberry, NAWeber, AE 4-Amino cyclohexylglycine analogues as potent dipeptidyl peptidase IV inhibitors. Bioorg Med Chem Lett14:43-6 (2003) Dipeptidyl peptidase 4
Name:Dipeptidyl peptidase 4
Type:Enzyme
Mol. Mass.:88271.01
Organism:Homo sapiens (Human)
Description:P27487
Residue:766
BDBM50137260
NameBDBM50137260
Synonyms:CHEMBL22679 | [4-((S)-1-Amino-2-oxo-2-pyrrolidin-1-yl-ethyl)-cyclohexyl]-carbamic acid benzyl ester
TypeSmall organic molecule
Emp. Form.C20H29N3O3
Mol. Mass.359.4626
SMILES[H][C@@]1(CC[C@@H](CC1)NC(=O)OCc1ccccc1)[C@H](N)C(=O)N1CCCC1